BDBM50109408 CHEMBL3601227
SMILES CN1CCN(CC1)c1ccc(Nc2ncc(Cl)c(NCc3cccc(NC(=O)C=C)c3)n2)cc1F
InChI Key InChIKey=QCQKHAHVDYWUNQ-UHFFFAOYSA-N
Data  1 IC50
  Tab Delimited (TSV)   2D SDfile   Computed 3D by Vconf -m prep SDfile
Find this compound or compounds like it in BindingDB:
Activity Spreadsheet -- Enzyme Inhibition Constant Data from BindingDB
Found 1 hit for monomerid = 50109408
TargetTyrosine-protein kinase JAK3(Homo sapiens (Human))
Harvard Medical School
Curated by ChEMBL
LigandPNGBDBM50109408(CHEMBL3601227)
Affinity DataIC50:  0.900nM. Assay description: Inhibition of JAK3 (unknown origin) by Z'-Lyte assay
In DepthDetails ArticlePubMed