BDBM50109458 1-(4-Chloro-phenyl)-3-(2-furan-2-yl-8-propyl-8H-pyrazolo[4,3-e][1,2,4]triazolo[1,5-c]pyrimidin-5-yl)-urea::1-(4-chlorophenyl)-3-(2-(furan-2-yl)-8-propyl-8H-pyrazolo[4,3-e][1,2,4]triazolo[1,5-c]pyrimidin-5-yl)urea::CHEMBL164905
SMILES CCCn1cc2c(n1)nc(NC(=O)Nc1ccc(Cl)cc1)n1nc(nc21)-c1ccco1
InChI Key InChIKey=YSKVVKBTAXRUQS-UHFFFAOYSA-N
Data  9 KI
  Tab Delimited (TSV)   2D SDfile   Computed 3D by Vconf -m prep SDfile
Find this compound or compounds like it in BindingDB:
Activity Spreadsheet -- Enzyme Inhibition Constant Data from BindingDB
Found 9 hits for monomerid = 50109458
TargetAdenosine receptor A3(Homo sapiens (Human))TBA
LigandPNGBDBM50109458(1-(4-Chloro-phenyl)-3-(2-furan-2-yl-8-propyl-8H-py...)
Affinity DataKi:  0.340nM. Assay description: Binding affinity to human adenosine A3 receptor
In DepthDetails Article
TargetAdenosine receptor A3(Homo sapiens (Human))TBA
LigandPNGBDBM50109458(1-(4-Chloro-phenyl)-3-(2-furan-2-yl-8-propyl-8H-py...)
Affinity DataKi:  0.340nM. Assay description: Displacement of [3H]NECA from human adenosine A3 receptor expressed in CHO cellsChecked by Author
In DepthDetails ArticlePubMed
TargetAdenosine receptor A3(Homo sapiens (Human))TBA
LigandPNGBDBM50109458(1-(4-Chloro-phenyl)-3-(2-furan-2-yl-8-propyl-8H-py...)
Affinity DataKi:  0.340nM. Assay description: Binding affinity for human adenosine A3 receptor
In DepthDetails ArticlePubMed
TargetAdenosine receptor A3(Homo sapiens (Human))TBA
LigandPNGBDBM50109458(1-(4-Chloro-phenyl)-3-(2-furan-2-yl-8-propyl-8H-py...)
Affinity DataKi:  0.340nM. Assay description: Displacement of [3H]-MRE3008-F20 from human Adenosine A3 receptor expressed in HEK cells; range 0.24-0.48
In DepthDetails ArticlePubMed
TargetAdenosine receptor A2b(Homo sapiens (Human))
Università
Curated by ChEMBL
LigandPNGBDBM50109458(1-(4-Chloro-phenyl)-3-(2-furan-2-yl-8-propyl-8H-py...)
Affinity DataKi:  76nM. Assay description: Displacement of [3H]-DPCPX from human Adenosine A2B receptor expressed in HEK-293 cells; range 56-103
In DepthDetails ArticlePubMed
TargetAdenosine receptor A2a(Homo sapiens (Human))
Università
Curated by ChEMBL
LigandPNGBDBM50109458(1-(4-Chloro-phenyl)-3-(2-furan-2-yl-8-propyl-8H-py...)
Affinity DataKi:  140nM. Assay description: Displacement of [3H]-SCH-58,261 from human Adenosine A2A receptor expressed in HEK-293 cells; range 123-162
In DepthDetails ArticlePubMed
TargetAdenosine receptor A2a(Homo sapiens (Human))
Università
Curated by ChEMBL
LigandPNGBDBM50109458(1-(4-Chloro-phenyl)-3-(2-furan-2-yl-8-propyl-8H-py...)
Affinity DataKi:  140nM. Assay description: Displacement of [3H]NECA from human adenosine A2A receptor expressed in CHO cellsChecked by Author
In DepthDetails ArticlePubMed
TargetAdenosine receptor A1(Homo sapiens (Human))
Università
Curated by ChEMBL
LigandPNGBDBM50109458(1-(4-Chloro-phenyl)-3-(2-furan-2-yl-8-propyl-8H-py...)
Affinity DataKi:  325nM. Assay description: Displacement of [3H]-DPCPX from human Adenosine A1 receptor expressed in CHO cells; range 265-400
In DepthDetails ArticlePubMed
TargetAdenosine receptor A3(Homo sapiens (Human))TBA
LigandPNGBDBM50109458(1-(4-Chloro-phenyl)-3-(2-furan-2-yl-8-propyl-8H-py...)
Affinity DataKi:  339nM. Assay description: Displacement of [3H]MRE3008-F20 from human adenosine A3 receptor expressed in CHO cells after 120 mins
In DepthDetails ArticlePubMed