BDBM50109619 (2-Hydroxycarbamoyl-pyrrolidin-1-yl)-(4-methoxy-phenyl)-phosphinic acid ethyl ester::CHEMBL172181
SMILES CCOP(=O)(N1CCCC1C(=O)NO)c1ccc(OC)cc1
InChI Key InChIKey=MDDQQIMYYBMNMU-UHFFFAOYSA-N
Data  4 KI  1 IC50
  Tab Delimited (TSV)   2D SDfile   Computed 3D by Vconf -m prep SDfile
Find this compound or compounds like it in BindingDB:
Activity Spreadsheet -- Enzyme Inhibition Constant Data from BindingDB
Found 5 hits for monomerid = 50109619
TargetMatrix metalloproteinase-9(Homo sapiens (Human))
Nippon Organon K.K.
Curated by ChEMBL
LigandPNGBDBM50109619((2-Hydroxycarbamoyl-pyrrolidin-1-yl)-(4-methoxy-ph...)
Affinity DataKi:  316nM. Assay description: Inhibitory activity against matrix metalloprotease-9 (MMP-9)(gelatinase-B).
In DepthDetails ArticlePubMed
TargetStromelysin-1(Homo sapiens (Human))
Nippon Organon K.K.
Curated by ChEMBL
LigandPNGBDBM50109619((2-Hydroxycarbamoyl-pyrrolidin-1-yl)-(4-methoxy-ph...)
Affinity DataKi:  527nM. Assay description: Inhibitory activity against matrix metalloprotease-3 (MMP-3)(stromelysin-1).
In DepthDetails ArticlePubMed
TargetDisintegrin and metalloproteinase domain-containing protein 17(Homo sapiens (Human))
Nippon Organon K.K.
Curated by ChEMBL
LigandPNGBDBM50109619((2-Hydroxycarbamoyl-pyrrolidin-1-yl)-(4-methoxy-ph...)
Affinity DataKi: >780nM. Assay description: Inhibitory activity against tumor necrosis factor alpha converting enzyme (TACE) from human acute monocytic leukemia cell line.
In DepthDetails ArticlePubMed
TargetInterstitial collagenase(Homo sapiens (Human))
Nippon Organon K.K.
Curated by ChEMBL
LigandPNGBDBM50109619((2-Hydroxycarbamoyl-pyrrolidin-1-yl)-(4-methoxy-ph...)
Affinity DataKi: >850nM. Assay description: Inhibitory activity against matrix metalloprotease-1 (MMP-1)(recombinant human collagenase-1).
In DepthDetails ArticlePubMed
TargetDisintegrin and metalloproteinase domain-containing protein 9(Homo sapiens (Human))
Nippon Organon K.K.
Curated by ChEMBL
LigandPNGBDBM50109619((2-Hydroxycarbamoyl-pyrrolidin-1-yl)-(4-methoxy-ph...)
Affinity DataIC50: >1.00E+4nM. Assay description: Inhibition of the heparin binding epidermal growth factor (HB-EGF) release from fibrosarcoma HT1080 transfectants expressing alkaline phosphate (AP) ...
In DepthDetails ArticlePubMed