BDBM50109801 7-Amino-3-[2-(6,7-dimethoxy-3,4-dihydro-1H-isoquinolin-2-yl)-ethyl]-2-(4-dimethylamino-phenyl)-3H-quinazolin-4-one::CHEMBL154430
SMILES COc1cc2CCN(CCn3c(nc4cc(N)ccc4c3=O)-c3ccc(cc3)N(C)C)Cc2cc1OC
InChI Key InChIKey=ANYCZRNPIKYUJE-UHFFFAOYSA-N
Data  2 IC50
  Tab Delimited (TSV)   2D SDfile   Computed 3D by Vconf -m prep SDfile
Find this compound or compounds like it in BindingDB:
Activity Spreadsheet -- Enzyme Inhibition Constant Data from BindingDB
Found 2 hits for monomerid = 50109801
TargetATP-dependent translocase ABCB1(Mus musculus)
Xenova
Curated by ChEMBL
LigandPNGBDBM50109801(7-Amino-3-[2-(6,7-dimethoxy-3,4-dihydro-1H-isoquin...)
Affinity DataIC50:  7.20E+3nM. Assay description: Inhibitory activity against P-glyco-protein (Pgp) using accumulation assay for Pgp expressing EMT6/AR1.0 cells.
In DepthDetails ArticlePubMed
TargetMultidrug resistance-associated protein 1(Homo sapiens (Human))
Xenova
Curated by ChEMBL
LigandPNGBDBM50109801(7-Amino-3-[2-(6,7-dimethoxy-3,4-dihydro-1H-isoquin...)
Affinity DataIC50:  1.86E+4nM. Assay description: Inhibition of multidrug resistance associated protein type 1 (MRP1) assayed by an accumulation assay in COR.L23/R cells
In DepthDetails ArticlePubMed