BDBM50110034 1-{2-[4-Difluoromethoxy-3-(5-phenyl-pentyloxy)-phenyl]-propyl}-1,3-dihydro-imidazol-2-ylidene-cyanamide::CHEMBL160463
SMILES CC(Cn1ccnc1NC#N)c1ccc(OC(F)F)c(OCCCCCc2ccccc2)c1
InChI Key InChIKey=YIZJKOHNEXJBBV-UHFFFAOYSA-N
Data  1 IC50
  Tab Delimited (TSV)   2D SDfile   Computed 3D by Vconf -m prep SDfile
Find this compound or compounds like it in BindingDB:
Activity Spreadsheet -- Enzyme Inhibition Constant Data from BindingDB
Found 1 hit for monomerid = 50110034
TargetcAMP-specific 3',5'-cyclic phosphodiesterase 4B(Homo sapiens (Human))
Janssen-Cilag
Curated by ChEMBL
LigandPNGBDBM50110034(1-{2-[4-Difluoromethoxy-3-(5-phenyl-pentyloxy)-phe...)
Affinity DataIC50:  28nM. Assay description: Inhibitory activity against recombinant phosphodiesterase 4B (PDE4B) of human mononuclear lymphocytes
In DepthDetails ArticlePubMed