BDBM50110262 2-Pyridazin-4-yl-9-aza-bicyclo[4.2.1]non-2-ene::CHEMBL10585
SMILES C1CC2N[C@H]1CCC=C2c1ccnnc1
InChI Key InChIKey=SAOUDQKVCQGQDK-NUHJPDEHSA-N
Data  3 KI
  Tab Delimited (TSV)   2D SDfile   Computed 3D by Vconf -m prep SDfile
Find this compound or compounds like it in BindingDB:
Activity Spreadsheet -- Enzyme Inhibition Constant Data from BindingDB
Found 3 hits for monomerid = 50110262
TargetNeuronal acetylcholine receptor subunit beta-4(Rattus norvegicus (Rat))
Institut F£R Pharmazeutische Chemie Der Philipps-Universit£T Marburg
Curated by ChEMBL
LigandPNGBDBM50110262(2-Pyridazin-4-yl-9-aza-bicyclo[4.2.1]non-2-ene | C...)
Affinity DataKi:  2.5nM. Assay description: Binding affinity to Nicotinic acetylcholine receptor alpha3-beta4 using +/-[3H]epibatidine as radioligand in pig adrenal gland
In DepthDetails ArticlePubMed
TargetNeuronal acetylcholine receptor subunit alpha-7(Rattus norvegicus (Rat))
Institut F£R Pharmazeutische Chemie Der Philipps-Universit£T Marburg
Curated by ChEMBL
LigandPNGBDBM50110262(2-Pyridazin-4-yl-9-aza-bicyclo[4.2.1]non-2-ene | C...)
Affinity DataKi: >10nM. Assay description: Binding affinity to subtype Nicotinic acetylcholine receptor alpha7 using [3H]-MLA as radioligand in rat brain
In DepthDetails ArticlePubMed
TargetNeuronal acetylcholine receptor subunit alpha-4/beta-2(Rattus norvegicus (Rat))
Institut F£R Pharmazeutische Chemie Der Philipps-Universit£T Marburg
Curated by ChEMBL
LigandPNGBDBM50110262(2-Pyridazin-4-yl-9-aza-bicyclo[4.2.1]non-2-ene | C...)
Affinity DataKi:  19nM. Assay description: Binding affinity to Nicotinic acetylcholine receptor alpha4-beta2 using +/-[3H]epibatidine as radioligand in rat brain
In DepthDetails ArticlePubMed