BDBM50110533 1-[4-(4-{1-[4-(Benzo[1,3]dioxole-5-sulfonyl)-phenyl]-ethyl}-3-methyl-piperazin-1-yl)-piperidin-1-yl]-pentan-1-one::CHEMBL165337
SMILES CCCCC(=O)N1CCC(CC1)N1CCN([C@@H](C)c2ccc(cc2)S(=O)(=O)c2ccc3OCOc3c2)[C@H](C)C1
InChI Key InChIKey=IVZDBPFZFBRDKW-PKTZIBPZSA-N
Data  1 KI
  Tab Delimited (TSV)   2D SDfile   Computed 3D by Vconf -m prep SDfile
Find this compound or compounds like it in BindingDB:
Activity Spreadsheet -- Enzyme Inhibition Constant Data from BindingDB
Found 1 hit for monomerid = 50110533
TargetMuscarinic acetylcholine receptor M2(Homo sapiens (Human))
Schering-Plough Research Institute
Curated by ChEMBL
LigandPNGBDBM50110533(1-[4-(4-{1-[4-(Benzo[1,3]dioxole-5-sulfonyl)-pheny...)
Affinity DataKi:  1.30nM. Assay description: Binding affinity against human cloned Muscarinic acetylcholine receptor M2.
In DepthDetails ArticlePubMed