BDBM50110553 CHEMBL349142::[4-((R)-4-{(S)-1-[4-(Benzo[1,3]dioxole-5-sulfonyl)-phenyl]-ethyl}-3-methyl-piperazin-1-yl)-piperidin-1-yl]-(2,4-dichloro-phenyl)-methanone
SMILES C[C@H](N1CCN(C[C@H]1C)C1CCN(CC1)C(=O)c1ccc(Cl)cc1Cl)c1ccc(cc1)S(=O)(=O)c1ccc2OCOc2c1
InChI Key InChIKey=DZOYJXBICDVBKC-YADHBBJMSA-N
Data  1 KI
  Tab Delimited (TSV)   2D SDfile   Computed 3D by Vconf -m prep SDfile
Find this compound or compounds like it in BindingDB:
Activity Spreadsheet -- Enzyme Inhibition Constant Data from BindingDB
Found 1 hit for monomerid = 50110553
TargetMuscarinic acetylcholine receptor M2(Homo sapiens (Human))
Schering-Plough Research Institute
Curated by ChEMBL
LigandPNGBDBM50110553(CHEMBL349142 | [4-((R)-4-{(S)-1-[4-(Benzo[1,3]diox...)
Affinity DataKi:  0.300nM. Assay description: Binding affinity against human muscarinic acetylcholine receptor M2 using [3H]-N-methylscopolamine as radioligand
In DepthDetails ArticlePubMed