BDBM50110663 3,5-Dichloro-N-[3-(3,4-dichloro-phenyl)-2-[(Z)-methoxyimino]-5-(2-oxo-[1,4']bipiperidinyl-1'-yl)-pentyl]-N-methyl-benzamide::CHEMBL66106
SMILES CO\N=C(/CN(C)C(=O)c1cc(Cl)cc(Cl)c1)C(CCN1CCC(CC1)N1CCCCC1=O)c1ccc(Cl)c(Cl)c1
InChI Key InChIKey=CXFWIZDXIZCABO-AWQADKOQSA-N
Data  4 KI
  Tab Delimited (TSV)   2D SDfile   Computed 3D by Vconf -m prep SDfile
Find this compound or compounds like it in BindingDB:
Activity Spreadsheet -- Enzyme Inhibition Constant Data from BindingDB
Found 4 hits for monomerid = 50110663
TargetSubstance-K receptor(Homo sapiens (Human))
Schering-Plough Research Institute
Curated by ChEMBL
LigandPNGBDBM50110663(3,5-Dichloro-N-[3-(3,4-dichloro-phenyl)-2-[(Z)-met...)
Affinity DataKi:  1.60nM. Assay description: Binding affinity against recombinant human tachykinin receptor 2 in CHO cells using [3H]-NKA as a radioligand
In DepthDetails ArticlePubMed
TargetSubstance-K receptor(GUINEA PIG)
The Schering Plough Research Institute
Curated by ChEMBL
LigandPNGBDBM50110663(3,5-Dichloro-N-[3-(3,4-dichloro-phenyl)-2-[(Z)-met...)
Affinity DataKi:  2nM. Assay description: In vitro binding to Tachykinin receptor 2
In DepthDetails ArticlePubMed
TargetSubstance-P receptor(Homo sapiens (Human))
Schering-Plough Research Institute
Curated by ChEMBL
LigandPNGBDBM50110663(3,5-Dichloro-N-[3-(3,4-dichloro-phenyl)-2-[(Z)-met...)
Affinity DataKi:  4.70nM. Assay description: Binding affinity against recombinant human tachykinin receptor 1 in CHO cells using [3H]-Sar SP as a radioligand
In DepthDetails ArticlePubMed
TargetSubstance-P receptor(GUINEA PIG)
The Schering Plough Research Institute
Curated by ChEMBL
LigandPNGBDBM50110663(3,5-Dichloro-N-[3-(3,4-dichloro-phenyl)-2-[(Z)-met...)
Affinity DataKi:  5nM. Assay description: In vitro binding to Tachykinin receptor 1
In DepthDetails ArticlePubMed