BDBM50110694 11,22-Dicarboxy-25-isobutyl-15-(6-methoxy-3,5-dimethyl-7-phenyl-hepta-1,3-dienyl)-7,14,18,21-tetramethyl-6-methylene-2,5,8,13,17,20,24-heptaoxo-1,4,7,12,16,19hexaaza-cyclopentacos-3-ylmethyl-ammonium
SMILES CO[C@@H](Cc1ccccc1)[C@@H](C)\C=C(/C)\C=C\[C@@H]1NC(=O)[C@H](C)NC(=O)[C@@H](C)[C@@H](CC(=O)[C@H](CC(C)C)NC(=O)[C@@H](C[NH3+])NC(=O)C(=C)N(C)C(=O)CC[C@@H](NC(=O)[C@H]1C)C(O)=O)C(O)=O
InChI Key InChIKey=MYMBZIVXMFWLQH-NYAUCJIASA-O
Data  1 IC50
  Tab Delimited (TSV)   2D SDfile   Computed 3D by Vconf -m prep SDfile
Find this compound or compounds like it in BindingDB:
Activity Spreadsheet -- Enzyme Inhibition Constant Data from BindingDB
Found 1 hit for monomerid = 50110694
TargetSerine/threonine-protein phosphatase 2A 55 kDa regulatory subunit B(Gallus gallus)
The University Of Newcastle
Curated by ChEMBL
LigandPNGBDBM50110694(11,22-Dicarboxy-25-isobutyl-15-(6-methoxy-3,5-dime...)
Affinity DataIC50:  9nM. Assay description: Inhibition of microcystin analogues to catalytic subunits of Serine/threonine protein phosphatase 2A (PP2Ac)
In DepthDetails ArticlePubMed