BDBM50110797 9-[4-(Diphosphoryloxyphosphonylmethoxy)-cyclopent-2-enyl]guanine::9-[4-(Diphosphoryloxyphosphonylmethoxy)cyclopent-2-enyl]guanine::CHEMBL538904
SMILES Nc1nc2n(cnc2c(=O)[nH]1)C1CC(OCP(O)(=O)OP(O)(=O)OP(O)(O)=O)C=C1
InChI Key InChIKey=FBSKDDHRSQBRNC-UHFFFAOYSA-N
Data  1 IC50
  Tab Delimited (TSV)   2D SDfile   Computed 3D by Vconf -m prep SDfile
Find this compound or compounds like it in BindingDB:
Activity Spreadsheet -- Enzyme Inhibition Constant Data from BindingDB
Found 1 hit for monomerid = 50110797
TargetReverse transcriptase/RNaseH(Human immunodeficiency virus 1)
Russian Academy Of Sciences
Curated by ChEMBL
LigandPNGBDBM50110797(9-[4-(Diphosphoryloxyphosphonylmethoxy)-cyclopent-...)
Affinity DataIC50:  300nM. Assay description: Inhibition of DNA synthesis by HIV reverse transcriptase
In DepthDetails ArticlePubMed