BDBM50110913 CHEMBL3604703
SMILES Cc1cc(NCc2ccccc2)c2cccc(C(N)=O)c2n1
InChI Key InChIKey=XJYDUOHIXMNAJL-UHFFFAOYSA-N
Data  1 IC50
  Tab Delimited (TSV)   2D SDfile   Computed 3D by Vconf -m prep SDfile
Find this compound or compounds like it in BindingDB:
Activity Spreadsheet -- Enzyme Inhibition Constant Data from BindingDB
Found 1 hit for monomerid = 50110913
TargetADP-ribosyl cyclase/cyclic ADP-ribose hydrolase 1(Homo sapiens (Human))
Glaxosmithkline
Curated by ChEMBL
LigandPNGBDBM50110913(CHEMBL3604703)
Affinity DataIC50:  2.20E+4nM. Assay description: Inhibition of human CD38 extracellular domain expressed in Pichia pastoris using CHAPS and NAD by colorimetric-based assay
In DepthDetails ArticlePubMed