BDBM50110940 5-(4-Chloro-phenyl)-1-(2,4-dichloro-phenyl)-4-methyl-1H-pyrazole-3-carboxylic acid heptylamide::CHEMBL432272
SMILES CCCCCCCNC(=O)c1nn(c(c1C)-c1ccc(Cl)cc1)-c1ccc(Cl)cc1Cl
InChI Key InChIKey=ODBQQEGUBFGYFS-UHFFFAOYSA-N
Data  1 KI
  Tab Delimited (TSV)   2D SDfile   Computed 3D by Vconf -m prep SDfile
Find this compound or compounds like it in BindingDB:
Activity Spreadsheet -- Enzyme Inhibition Constant Data from BindingDB
Found 1 hit for monomerid = 50110940
TargetCannabinoid receptor 1(Rattus norvegicus (rat))
University Of South Carolina
Curated by ChEMBL
LigandPNGBDBM50110940(5-(4-Chloro-phenyl)-1-(2,4-dichloro-phenyl)-4-meth...)
Affinity DataKi:  3nM. Assay description: Inhibition of [3H]-CP-55,940 binding to cannabinoid receptor 1 in rat brain membranes.
In DepthDetails ArticlePubMed