BDBM50111026 9-[1-(5-Methyl-thiophen-2-yl)-meth-(Z)-ylidene]-7-aza-tricyclo[4.3.1.0*3,7*]decane-2-carboxylic acid methyl ester::CHEMBL117047
SMILES COC(=O)C1C2CCC3CC1\C(CN23)=C\c1ccc(C)s1
InChI Key InChIKey=UPWOCOQLXHPHGS-YRNVUSSQSA-N
Data  6 KI
  Tab Delimited (TSV)   2D SDfile   Computed 3D by Vconf -m prep SDfile
Find this compound or compounds like it in BindingDB:
Activity Spreadsheet -- Enzyme Inhibition Constant Data from BindingDB
Found 6 hits for monomerid = 50111026
TargetTransporter(Rattus norvegicus)
Georgetown University Medical Center
Curated by ChEMBL
LigandPNGBDBM50111026(9-[1-(5-Methyl-thiophen-2-yl)-meth-(Z)-ylidene]-7-...)
Affinity DataKi:  4.90nM. Assay description: Ability to inhibit reuptake of norepinephrine ([3H]NE) at norepinephrine transporter of rat parietal/occipital region
In DepthDetails ArticlePubMed
TargetTransporter(Rattus norvegicus)
Georgetown University Medical Center
Curated by ChEMBL
LigandPNGBDBM50111026(9-[1-(5-Methyl-thiophen-2-yl)-meth-(Z)-ylidene]-7-...)
Affinity DataKi:  4.90nM. Assay description: Inhibition of [3H]-NE reuptake at Norepinephrine transporter in rat parietal/occipital cortex
In DepthDetails ArticlePubMed
TargetSodium-dependent serotonin transporter(Rattus norvegicus (rat))
Georgetown University Medical Center
Curated by ChEMBL
LigandPNGBDBM50111026(9-[1-(5-Methyl-thiophen-2-yl)-meth-(Z)-ylidene]-7-...)
Affinity DataKi:  179nM. Assay description: Inhibition of [3H]5-HT reuptake at serotonin transporter in rat mid brain
In DepthDetails ArticlePubMed
TargetSodium-dependent serotonin transporter(Rattus norvegicus (rat))
Georgetown University Medical Center
Curated by ChEMBL
LigandPNGBDBM50111026(9-[1-(5-Methyl-thiophen-2-yl)-meth-(Z)-ylidene]-7-...)
Affinity DataKi:  179nM. Assay description: Ability to inhibit reuptake of serotonin ([3H]5-HT) at serotonin transporter of rat midbrian
In DepthDetails ArticlePubMed
TargetSodium-dependent dopamine transporter(Rattus norvegicus (rat))
Georgetown University Medical Center
Curated by ChEMBL
LigandPNGBDBM50111026(9-[1-(5-Methyl-thiophen-2-yl)-meth-(Z)-ylidene]-7-...)
Affinity DataKi:  403nM. Assay description: Inhibition of [3H]DA reuptake at dopamine transporter in rat striatum
In DepthDetails ArticlePubMed
TargetSodium-dependent dopamine transporter(Rattus norvegicus (rat))
Georgetown University Medical Center
Curated by ChEMBL
LigandPNGBDBM50111026(9-[1-(5-Methyl-thiophen-2-yl)-meth-(Z)-ylidene]-7-...)
Affinity DataKi:  403nM. Assay description: Ability to inhibit reuptake of dopamine ([3H]DA) at dopamine transporter of rat striatum
In DepthDetails ArticlePubMed