BDBM50111088 9-Fluoro-2-pyridin-2-yl-3,4,5,6-tetrahydro-1,3-diaza-benzo[e]azulene::CHEMBL266904
SMILES Fc1ccc2CCCc3[nH]c(nc3-c2c1)-c1ccccn1
InChI Key InChIKey=RUJDYJGDJWCUGE-UHFFFAOYSA-N
Data  1 IC50
  Tab Delimited (TSV)   2D SDfile   Computed 3D by Vconf -m prep SDfile
Find this compound or compounds like it in BindingDB:
Activity Spreadsheet -- Enzyme Inhibition Constant Data from BindingDB
Found 1 hit for monomerid = 50111088
TargetNeuropeptide Y receptor type 5(Homo sapiens (Human))
Fujisawa Pharmaceutical
Curated by ChEMBL
LigandPNGBDBM50111088(9-Fluoro-2-pyridin-2-yl-3,4,5,6-tetrahydro-1,3-dia...)
Affinity DataIC50:  46nM. Assay description: Concentration that inhibited 50% of binding of 125 I -PYY ligand to human Neuropeptide Y receptor type 5
In DepthDetails ArticlePubMed