BDBM50111122 2N-(4-Benzamidinemethyl)-1-[2-Carbamicacidmethylester-3,3-diphenyl-(2R)-propanoyl]-(2S)-tetrahydro-1H-2-pyrrolecarboxamide;TFA::CHEMBL120187
SMILES COC(=O)N[C@H](C(c1ccccc1)c1ccccc1)C(=O)N1CCC[C@H]1C(=O)NCc1ccc(cc1)C(N)=N
InChI Key InChIKey=MNSLHONIQQUMSX-AZGAKELHSA-N
Data  3 KI
  Tab Delimited (TSV)   2D SDfile   Computed 3D by Vconf -m prep SDfile
Find this compound or compounds like it in BindingDB:
Activity Spreadsheet -- Enzyme Inhibition Constant Data from BindingDB
Found 3 hits for monomerid = 50111122
TargetProthrombin(Homo sapiens (Human))
Lg Life Sciences
Curated by ChEMBL
LigandPNGBDBM50111122(2N-(4-Benzamidinemethyl)-1-[2-Carbamicacidmethyles...)
Affinity DataKi:  0.0300nM. Assay description: In vitro inhibition constant (Ki) against human thrombin
In DepthDetails ArticlePubMed
TargetProthrombin(Homo sapiens (Human))
Lg Life Sciences
Curated by ChEMBL
LigandPNGBDBM50111122(2N-(4-Benzamidinemethyl)-1-[2-Carbamicacidmethyles...)
Affinity DataKi:  0.0360nM. Assay description: Binding affinity against human thrombin
In DepthDetails ArticlePubMed
TargetSerine protease 1(Bos taurus (bovine))
Life Science R & D, Lgci
Curated by ChEMBL
LigandPNGBDBM50111122(2N-(4-Benzamidinemethyl)-1-[2-Carbamicacidmethyles...)
Affinity DataKi:  0.310nM. Assay description: Binding affinity against bovine trypsin
In DepthDetails ArticlePubMed