BDBM50111335 (6-Ethoxy-naphthalen-1-yl)-[4-(4-isopropylsulfanyl-benzyl)-[1,4']bipiperidinyl-1'-yl]-methanone::CHEMBL12064
SMILES CCOc1ccc2c(cccc2c1)C(=O)N1CCC(CC1)N1CCC(Cc2ccc(SC(C)C)cc2)CC1
InChI Key InChIKey=ITTNKFNGDHHQSI-UHFFFAOYSA-N
Data  1 KI
  Tab Delimited (TSV)   2D SDfile   Computed 3D by Vconf -m prep SDfile
Find this compound or compounds like it in BindingDB:
Activity Spreadsheet -- Enzyme Inhibition Constant Data from BindingDB
Found 1 hit for monomerid = 50111335
TargetMuscarinic acetylcholine receptor M2(Homo sapiens (Human))
Schering-Plough Research Institute
Curated by ChEMBL
LigandPNGBDBM50111335((6-Ethoxy-naphthalen-1-yl)-[4-(4-isopropylsulfanyl...)
Affinity DataKi:  14nM. Assay description: Binding affinity against muscarinic acetylcholine receptor M2 stably expressed in CHO-K1 cells using [3H]-QNB as radioligand.
In DepthDetails ArticlePubMed