BDBM50111377 CHEMBL3604885
SMILES Cc1ccc(cc1)-c1nc(N)ncc1-c1cc(F)c(O)c(F)c1
InChI Key InChIKey=HPQKQSNTXXYIDR-UHFFFAOYSA-N
Data  1 IC50  1 EC50
  Tab Delimited (TSV)   2D SDfile   Computed 3D by Vconf -m prep SDfile
Find this compound or compounds like it in BindingDB:
Activity Spreadsheet -- Enzyme Inhibition Constant Data from BindingDB
Found 2 hits for monomerid = 50111377
TargetRibosomal protein S6 kinase alpha-3(Mus musculus)
Novartis Institutes For Biomedical Research
Curated by ChEMBL
LigandPNGBDBM50111377(CHEMBL3604885)
Affinity DataEC50:  360nM. Assay description: Inhibition of RSK2 in mouse BAF cells expressing activated FGFR assessed as reduction of YB1 phosphorylation at Ser102 by electochemiluminescence ass...
In DepthDetails ArticlePubMed
TargetRibosomal protein S6 kinase alpha-3(Homo sapiens (Human))
Novartis Institutes For Biomedical Research
Curated by ChEMBL
LigandPNGBDBM50111377(CHEMBL3604885)
Affinity DataIC50:  10nM. Assay description: Inhibition of human recombinant Histidine-tagged RSK2 using biotin-AGAGRSRHSSYPAGT-OH as substrate preincubated for 30 mins followed by ATP and subst...
In DepthDetails ArticlePubMed