BDBM50111556 CHEMBL297236::Dimethyl-{4-[3-(3,4,5-trimethoxy-phenyl)-3H-imidazol-4-yl]-phenyl}-amine::N,N-dimethyl-4-(1-(3,4,5-trimethoxyphenyl)-1H-imidazol-5-yl)aniline
SMILES COc1cc(cc(OC)c1OC)-n1cncc1-c1ccc(cc1)N(C)C
InChI Key InChIKey=YLXGYHZPMHNEKX-UHFFFAOYSA-N
Data  1 IC50
  Tab Delimited (TSV)   2D SDfile   Computed 3D by Vconf -m prep SDfile
Find this compound or compounds like it in BindingDB:
Activity Spreadsheet -- Enzyme Inhibition Constant Data from BindingDB
Found 1 hit for monomerid = 50111556
TargetTubulin beta-2B chain(Bos taurus)
Abbott Laboratories
Curated by ChEMBL
LigandPNGBDBM50111556(CHEMBL297236 | Dimethyl-{4-[3-(3,4,5-trimethoxy-ph...)
Affinity DataIC50:  2.30E+4nM. Assay description: Concentration needed to inhibit tubulin polymerization by 50%
In DepthDetails ArticlePubMed