BDBM50111567 2-Methoxy-5-[4-(3,4,5-trimethoxy-phenyl)-oxazol-5-yl]-phenol::CHEMBL45473
SMILES COc1ccc(cc1O)-c1ocnc1-c1cc(OC)c(OC)c(OC)c1
InChI Key InChIKey=IORWTZSITGORCZ-UHFFFAOYSA-N
Data  1 IC50
  Tab Delimited (TSV)   2D SDfile   Computed 3D by Vconf -m prep SDfile
Find this compound or compounds like it in BindingDB:
Activity Spreadsheet -- Enzyme Inhibition Constant Data from BindingDB
Found 1 hit for monomerid = 50111567
TargetTubulin beta-2B chain(Bos taurus)
Abbott Laboratories
Curated by ChEMBL
LigandPNGBDBM50111567(2-Methoxy-5-[4-(3,4,5-trimethoxy-phenyl)-oxazol-5-...)
Affinity DataIC50:  980nM. Assay description: Concentration needed to inhibit tubulin polymerization by 50%
In DepthDetails ArticlePubMed