BDBM50111807 (R)-N-Hydroxy-2-[(4-methoxy-benzenesulfonyl)-(4-methyl-benzyl)-amino]-3-thiophen-2-yl-propionamide::CHEMBL21187
SMILES COc1ccc(cc1)S(=O)(=O)N(Cc1ccc(C)cc1)[C@H](Cc1cccs1)C(=O)NO
InChI Key InChIKey=KVDUHWXHLYZRTK-OAQYLSRUSA-N
Data  1 IC50
  Tab Delimited (TSV)   2D SDfile   Computed 3D by Vconf -m prep SDfile
Find this compound or compounds like it in BindingDB:
Activity Spreadsheet -- Enzyme Inhibition Constant Data from BindingDB
Found 1 hit for monomerid = 50111807
TargetBone morphogenetic protein 1(Homo sapiens (Human))
Roche Bioscience
Curated by ChEMBL
LigandPNGBDBM50111807((R)-N-Hydroxy-2-[(4-methoxy-benzenesulfonyl)-(4-me...)
Affinity DataIC50:  110nM. Assay description: Inhibitory activity against procollagen C-proteinase (PCP).
In DepthDetails ArticlePubMed