BDBM50112009 1-(2,6-Dichloro-pyridin-4-yl)-3-[4-(1H-imidazol-4-ylmethyl)-benzyl]-urea::CHEMBL427127
SMILES Clc1cc(NC(=O)NCc2ccc(Cc3cnc[nH]3)cc2)cc(Cl)n1
InChI Key InChIKey=JRVPVKHCCBQREK-UHFFFAOYSA-N
Data  1 KI
  Tab Delimited (TSV)   2D SDfile   Computed 3D by Vconf -m prep SDfile
Find this compound or compounds like it in BindingDB:
Activity Spreadsheet -- Enzyme Inhibition Constant Data from BindingDB
Found 1 hit for monomerid = 50112009
TargetHistamine H3 receptor(GUINEA PIG)
The Schering Plough Research Institute
Curated by ChEMBL
LigandPNGBDBM50112009(1-(2,6-Dichloro-pyridin-4-yl)-3-[4-(1H-imidazol-4-...)
Affinity DataKi:  3nM. Assay description: Compound was evaluated for its binding affinity against Histamine H3 receptor of guinea pig brain membrane
In DepthDetails ArticlePubMed