BDBM50112035 4-Amino-N-{1-[1-(3-amino-2-hydroxy-propyl)-piperidin-4-ylmethyl]-piperidin-4-yl}-5-chloro-2-methoxy-benzamide::CHEMBL433984
SMILES COc1cc(N)c(Cl)cc1C(=O)NC1CCN(CC2CCN(CC(O)CN)CC2)CC1
InChI Key InChIKey=PNAYGRSQMBUGLN-UHFFFAOYSA-N
Data  1 IC50
  Tab Delimited (TSV)   2D SDfile   Computed 3D by Vconf -m prep SDfile
Find this compound or compounds like it in BindingDB:
Activity Spreadsheet -- Enzyme Inhibition Constant Data from BindingDB
Found 1 hit for monomerid = 50112035
Target5-hydroxytryptamine receptor 4(GUINEA PIG)
Dainippon Pharmaceutical
Curated by ChEMBL
LigandPNGBDBM50112035(4-Amino-N-{1-[1-(3-amino-2-hydroxy-propyl)-piperid...)
Affinity DataIC50:  14nM. Assay description: Inhibitory activity against 5-hydroxytryptamine 4 receptor of guinea pig striatum using [3H]-GR-113,808 as radioligand
In DepthDetails ArticlePubMed