BDBM50112194 CHEMBL54334::N-[5-(6-Cyclopentylamino-purin-9-yl)-4-hydroxy-2-hydroxymethyl-tetrahydro-furan-3-yl]-4-thiophen-2-yl-butyramide
SMILES OC[C@H]1O[C@H]([C@H](O)[C@H]1NC(=O)CCCc1cccs1)n1cnc2c(NC3CCCC3)ncnc12
InChI Key InChIKey=SLQOCBSEBZMZGE-RWSUSOHTSA-N
Data  4 KI
  Tab Delimited (TSV)   2D SDfile   Computed 3D by Vconf -m prep SDfile
Find this compound or compounds like it in BindingDB:
Activity Spreadsheet -- Enzyme Inhibition Constant Data from BindingDB
Found 4 hits for monomerid = 50112194
TargetAdenosine receptor A1(Rattus norvegicus (rat))
Ghent University
Curated by ChEMBL
LigandPNGBDBM50112194(CHEMBL54334 | N-[5-(6-Cyclopentylamino-purin-9-yl)...)
Affinity DataKi:  0.690nM. Assay description: GTP-induced shift at rat Adenosine A1 receptor (A1AR)
In DepthDetails ArticlePubMed
TargetAdenosine receptor A1(Rattus norvegicus (rat))
Ghent University
Curated by ChEMBL
LigandPNGBDBM50112194(CHEMBL54334 | N-[5-(6-Cyclopentylamino-purin-9-yl)...)
Affinity DataKi:  46nM. Assay description: Binding affinity at rat Adenosine A1 receptor in the presence of GTP
In DepthDetails ArticlePubMed
TargetAdenosine receptor A1(Rattus norvegicus (rat))
Ghent University
Curated by ChEMBL
LigandPNGBDBM50112194(CHEMBL54334 | N-[5-(6-Cyclopentylamino-purin-9-yl)...)
Affinity DataKi:  67nM. Assay description: Binding affinity at rat Adenosine A1 receptor in the absence of GTP
In DepthDetails ArticlePubMed
TargetAdenosine receptor A1(Homo sapiens (Human))
Ghent University
Curated by ChEMBL
LigandPNGBDBM50112194(CHEMBL54334 | N-[5-(6-Cyclopentylamino-purin-9-yl)...)
Affinity DataKi:  630nM. Assay description: Binding affinity at human Adenosine A1 receptor expressed in CHO cells
In DepthDetails ArticlePubMed