BDBM50113287 3-[(4,8-dimethyl-nona-3,7-dienyl)-methyl-amino]-propyl trihydrogendiphosphate(3-aza-homoFPP)::CHEMBL419627
SMILES [#6]-[#7](-[#6]-[#6]-[#6]-[#8]P([#8])(=O)[#8]P([#8])([#8])=O)-[#6]-[#6]\[#6]=[#6](/[#6])-[#6]-[#6]\[#6]=[#6](/[#6])-[#6]
InChI Key InChIKey=PNEIVJAQBZSMGD-XNTDXEJSSA-N
Data  1 IC50
  Tab Delimited (TSV)   2D SDfile   Computed 3D by Vconf -m prep SDfile
Find this compound or compounds like it in BindingDB:
Activity Spreadsheet -- Enzyme Inhibition Constant Data from BindingDB
Found 1 hit for monomerid = 50113287
TargetGeranylgeranyl pyrophosphate synthase(Homo sapiens (Human))
University Of Illinois At Urbana-Champaign
Curated by ChEMBL
LigandPNGBDBM50113287(3-[(4,8-dimethyl-nona-3,7-dienyl)-methyl-amino]-pr...)
Affinity DataIC50:  310nM. Assay description: Inhibitory activity against the human recombinant geranylgeranyl diphosphate synthase (GGPPSase).
In DepthDetails ArticlePubMed