BDBM50113343 2-[1,2]Dithiolan-3-yl-N-{4-[(thiophene-2-carboximidoyl)-amino]-phenyl}-acetamide::CHEMBL34792
SMILES NC(=Nc1ccc(NC(=O)CC2CCSS2)cc1)c1cccs1
InChI Key InChIKey=ZFXSGMFTRMVFCX-UHFFFAOYSA-N
Data  1 IC50
  Tab Delimited (TSV)   2D SDfile   Computed 3D by Vconf -m prep SDfile
Find this compound or compounds like it in BindingDB:
Activity Spreadsheet -- Enzyme Inhibition Constant Data from BindingDB
Found 1 hit for monomerid = 50113343
TargetNitric oxide synthase, brain(Homo sapiens (Human))
Institute Henri Beaufour
Curated by ChEMBL
LigandPNGBDBM50113343(2-[1,2]Dithiolan-3-yl-N-{4-[(thiophene-2-carboximi...)
Affinity DataIC50:  4.40E+3nM. Assay description: In vitro inhibition concentration of the compound was evaluated on the effect of conversion by Nitric Oxide synthase of [3H]-L-arginine into [3H]-L-c...
In DepthDetails ArticlePubMed