BDBM50113429 CHEMBL3604498
SMILES CCNc1nccnc1-c1cc(Cl)ccc1NS(=O)(=O)c1ccc(cc1)C(C)(C)C
InChI Key InChIKey=WAMZSBDDHYCFLK-UHFFFAOYSA-N
Data  1 IC50
  Tab Delimited (TSV)   2D SDfile   Computed 3D by Vconf -m prep SDfile
Find this compound or compounds like it in BindingDB:
Activity Spreadsheet -- Enzyme Inhibition Constant Data from BindingDB
Found 1 hit for monomerid = 50113429
TargetC-C chemokine receptor type 9(Homo sapiens (Human))
Cubist Pharmaceuticals
Curated by ChEMBL
LigandPNGBDBM50113429(CHEMBL3604498)
Affinity DataIC50:  421nM. Assay description: Antagonist activity at CCR9 receptor (unknown origin) assessed as inhibition of TECK-induced calcium mobilization incubated for 10 mins prior to TECK...
In DepthDetails ArticlePubMed