BDBM50113487 CHEMBL3604623
SMILES Clc1cccc(c1)C(=O)Nc1cc(cnc1Cl)-c1ccc2nc(NC3CC3)sc2c1
InChI Key InChIKey=IACDQKWPLBPDSV-UHFFFAOYSA-N
Data  1 IC50
  Tab Delimited (TSV)   2D SDfile   Computed 3D by Vconf -m prep SDfile
Find this compound or compounds like it in BindingDB:
Activity Spreadsheet -- Enzyme Inhibition Constant Data from BindingDB
Found 1 hit for monomerid = 50113487
TargetSmoothened homolog(Mus musculus)
Soochow University
Curated by ChEMBL
LigandPNGBDBM50113487(CHEMBL3604623)
Affinity DataIC50:  150nM. Assay description: Inhibition of SMO in mouse NIH/3T3 cells assessed as inhibition of SAG-induced hedgehog-mediated luminescence signaling by GRE-luciferase reporter ge...
In DepthDetails ArticlePubMed