BDBM50113503 CHEMBL3604615
SMILES CC(=O)Nc1nc2ccc(cc2s1)-c1cnc(Cl)c(NC(=O)c2cccc(F)c2)c1
InChI Key InChIKey=GZUQPOFBGVLSQM-UHFFFAOYSA-N
Data  1 IC50
  Tab Delimited (TSV)   2D SDfile   Computed 3D by Vconf -m prep SDfile
Find this compound or compounds like it in BindingDB:
Activity Spreadsheet -- Enzyme Inhibition Constant Data from BindingDB
Found 1 hit for monomerid = 50113503
TargetSmoothened homolog(Mus musculus)
Soochow University
Curated by ChEMBL
LigandPNGBDBM50113503(CHEMBL3604615)
Affinity DataIC50:  5.00E+3nM. Assay description: Inhibition of SMO in mouse NIH/3T3 cells assessed as inhibition of SAG-induced hedgehog-mediated luminescence signaling by GRE-luciferase reporter ge...
In DepthDetails ArticlePubMed