BDBM50113647 CHEMBL3604804
SMILES COC(=O)N(Cc1ccc2OCC(=O)Nc2n1)C12CCC(CCc3c(F)cnc4ccc(OC)nc34)(CC1)OC2
InChI Key InChIKey=XKABRHVNAYURJZ-UHFFFAOYSA-N
Data  1 IC50
  Tab Delimited (TSV)   2D SDfile   Computed 3D by Vconf -m prep SDfile
Find this compound or compounds like it in BindingDB:
Activity Spreadsheet -- Enzyme Inhibition Constant Data from BindingDB
Found 1 hit for monomerid = 50113647
TargetPotassium voltage-gated channel subfamily H member 2(Homo sapiens (Human))
Merck Research Laboratories
Curated by ChEMBL
LigandPNGBDBM50113647(CHEMBL3604804)
Affinity DataIC50:  6.10E+3nM. Assay description: Inhibition of MK499 binding to human ERG
In DepthDetails ArticlePubMed