BDBM50113790 CHEMBL84389::S-4-{2-[2-(1-Carbamimidoyl-piperidin-4-yloxy)-ethyl]-piperidin-1-yl}-3-(cycloheptyl-methyl-amino)-4-oxo-butyric acid
SMILES CN([C@@H](CC(O)=O)C(=O)N1CCCC[C@H]1CCOC1CCN(CC1)C(N)=N)C1CCCCCC1
InChI Key InChIKey=DGFVROQLZQFXQN-UNMCSNQZSA-N
Data  2 KI
  Tab Delimited (TSV)   2D SDfile   Computed 3D by Vconf -m prep SDfile
Find this compound or compounds like it in BindingDB:
Activity Spreadsheet -- Enzyme Inhibition Constant Data from BindingDB
Found 2 hits for monomerid = 50113790
TargetProthrombin(Homo sapiens (Human))
Pfizer
Curated by ChEMBL
LigandPNGBDBM50113790(CHEMBL84389 | S-4-{2-[2-(1-Carbamimidoyl-piperidin...)
Affinity DataKi:  0.530nM. Assay description: In vitro inhibition of human thrombin.
In DepthDetails ArticlePubMed
TargetSerine protease 1(Homo sapiens (Human))
Pfizer
Curated by ChEMBL
LigandPNGBDBM50113790(CHEMBL84389 | S-4-{2-[2-(1-Carbamimidoyl-piperidin...)
Affinity DataKi:  810nM. Assay description: In vitro inhibition of human trypsin.
In DepthDetails ArticlePubMed