BDBM50113823 4-Butyl-5-piperidin-4-yl-isoxazol-3-ol; hydrobromide::CHEMBL541065
SMILES CCCCc1c(o[nH]c1=O)C1CCNCC1
InChI Key InChIKey=DZSIUIWHCOIVTF-UHFFFAOYSA-N
Data  1 IC50
  Tab Delimited (TSV)   2D SDfile   Computed 3D by Vconf -m prep SDfile
Find this compound or compounds like it in BindingDB:
Activity Spreadsheet -- Enzyme Inhibition Constant Data from BindingDB
Found 1 hit for monomerid = 50113823
TargetGamma-aminobutyric acid type B receptor subunit 1(Rattus norvegicus (Rat))
The Royal Danish School Of Pharmacy
Curated by ChEMBL
LigandPNGBDBM50113823(4-Butyl-5-piperidin-4-yl-isoxazol-3-ol; hydrobromi...)
Affinity DataIC50: >1.00E+5nM. Assay description: Affinity for GABA-B receptor by inhibiting GABA uptake into rat brain synaptosomes
In DepthDetails ArticlePubMed