BDBM50113844 CHEMBL3605123
SMILES OCCCCCOc1ccc2ncc(F)c(CCC34CCC(CC3)(CO4)NCc3ccc4OCC(=O)Nc4n3)c2n1
InChI Key InChIKey=ATODYUVMSIEGRJ-UHFFFAOYSA-N
Data  1 IC50
  Tab Delimited (TSV)   2D SDfile   Computed 3D by Vconf -m prep SDfile
Find this compound or compounds like it in BindingDB:
Activity Spreadsheet -- Enzyme Inhibition Constant Data from BindingDB
Found 1 hit for monomerid = 50113844
TargetPotassium voltage-gated channel subfamily H member 2(Homo sapiens (Human))
Merck Research Laboratories
Curated by ChEMBL
LigandPNGBDBM50113844(CHEMBL3605123)
Affinity DataIC50:  700nM. Assay description: Inhibition of human ERG assessed as reduction in MK499 competitive binding
In DepthDetails ArticlePubMed