BDBM50113855 2,2-Difluoro-3,3-dihydroxy-6-methyl-4-{3-methyl-2-[3-methyl-2-(3-methyl-butyrylamino)-butyrylamino]-butyrylamino}-heptanoic acid methylamide::CHEMBL309445
SMILES CNC(=O)C(F)(F)C(O)(O)[C@@H](CC(C)C)NC(=O)C(NC(=O)C(NC(=O)CC(C)C)C(C)C)C(C)C
InChI Key InChIKey=MCIRWALUVUIXMI-IPJUCJBFSA-N
Data  1 KI
  Tab Delimited (TSV)   2D SDfile   Computed 3D by Vconf -m prep SDfile
Find this compound or compounds like it in BindingDB:
Activity Spreadsheet -- Enzyme Inhibition Constant Data from BindingDB
Found 1 hit for monomerid = 50113855
TargetPenicillopepsin-1(Penicillium janthinellum)
University Of Parma
Curated by ChEMBL
LigandPNGBDBM50113855(2,2-Difluoro-3,3-dihydroxy-6-methyl-4-{3-methyl-2-...)
Affinity DataKi:  1.00E+3nM. Assay description: Binding affinity against penicillopepsin
In DepthDetails ArticlePubMed