BDBM50114090 CHEMBL3604067
SMILES CCO[C@@H](CC(O)=O)c1ccc(O[C@@H]2CCc3c2cccc3C(F)(F)F)nc1
InChI Key InChIKey=AGMMSVUIVBGERN-SJORKVTESA-N
Data  1 EC50
  Tab Delimited (TSV)   2D SDfile   Computed 3D by Vconf -m prep SDfile
Find this compound or compounds like it in BindingDB:
Activity Spreadsheet -- Enzyme Inhibition Constant Data from BindingDB
Found 1 hit for monomerid = 50114090
TargetFree fatty acid receptor 1(Homo sapiens (Human))
Daiichi Sankyo
Curated by ChEMBL
LigandPNGBDBM50114090(CHEMBL3604067)
Affinity DataEC50:  20nM. Assay description: Agonist activity at human GPR40 expressed in CHO cells assessed as increase in intracellular calcium level after 60 mins by FLIPR assay
In DepthDetails ArticlePubMed