BDBM50114320 3,7-Dimethyl-octanoic acid 4-{(S)-2-[(S)-2-((R)-2-amino-3-mercapto-propionylamino)-3-methyl-butyrylamino]-2-methoxycarbonyl-ethyl}-phenyl ester::CHEMBL41039
SMILES COC(=O)[C@H](Cc1ccc(OC(=O)CC(C)CCCC(C)C)cc1)NC(=O)[C@@H](NC(=O)[C@@H](N)CS)C(C)C
InChI Key InChIKey=LWEDDYPBBDFUAS-CULXIKHASA-N
Data  1 IC50
  Tab Delimited (TSV)   2D SDfile   Computed 3D by Vconf -m prep SDfile
Find this compound or compounds like it in BindingDB:
Activity Spreadsheet -- Enzyme Inhibition Constant Data from BindingDB
Found 1 hit for monomerid = 50114320
TargetProtein farnesyltransferase subunit beta/geranylgeranyltransferase type-1 subunit alpha(Bos taurus (bovine))
Department Of Chemistry And School Of Molecular Science(Bk21)
Curated by ChEMBL
LigandPNGBDBM50114320(3,7-Dimethyl-octanoic acid 4-{(S)-2-[(S)-2-((R)-2-...)
Affinity DataIC50:  8.10E+3nM. Assay description: In vitro inhibition of bovine Farnesyltrasferase.
In DepthDetails ArticlePubMed