BDBM50114683 5-(4-Chloro-phenyl)-1-(2,4-dichloro-phenyl)-4-methyl-1H-pyrazole-3-carboxylic acid N'-methyl-hydrazide::CHEMBL88548
SMILES CNNC(=O)c1nn(c(c1C)-c1ccc(Cl)cc1)-c1ccc(Cl)cc1Cl
InChI Key InChIKey=ABGHTQVGZLITLA-UHFFFAOYSA-N
Data  3 KI
  Tab Delimited (TSV)   2D SDfile   Computed 3D by Vconf -m prep SDfile
Find this compound or compounds like it in BindingDB:
Activity Spreadsheet -- Enzyme Inhibition Constant Data from BindingDB
Found 3 hits for monomerid = 50114683
TargetCannabinoid receptor 1(Rattus norvegicus (rat))
Research Triangle Institute
Curated by ChEMBL
LigandPNGBDBM50114683(5-(4-Chloro-phenyl)-1-(2,4-dichloro-phenyl)-4-meth...)
Affinity DataKi:  429nM. Assay description: Binding affinity in a competition assay by displacement of [3H]- SR-141,716 from Cannabinoid receptor 1 in rat whole brain membrane preparation
In DepthDetails ArticlePubMed
TargetCannabinoid receptor 1(Rattus norvegicus (rat))
Research Triangle Institute
Curated by ChEMBL
LigandPNGBDBM50114683(5-(4-Chloro-phenyl)-1-(2,4-dichloro-phenyl)-4-meth...)
Affinity DataKi:  555nM. Assay description: Binding affinity in a competition assay by displacement of [3H]- CP 55 940 from Cannabinoid receptor 1 in rat whole brain membrane preparation
In DepthDetails ArticlePubMed
TargetCannabinoid receptor 2(Homo sapiens (Human))
Research Triangle Institute
Curated by ChEMBL
LigandPNGBDBM50114683(5-(4-Chloro-phenyl)-1-(2,4-dichloro-phenyl)-4-meth...)
Affinity DataKi:  6.66E+3nM. Assay description: Binding affinity at cannabinoid receptor 2 in a competition assay with [3H]-CP- 55 940 as radioligand
In DepthDetails ArticlePubMed