BDBM50114746 1N-[1-carbamoyl-2-(1H-3-indolyl)-(1S)-ethyl]-5-amino(imino)methylamino-2-[1-[1-methylcarboxamido-2-(3-pyridyl)-(1S)-ethylcarboxamido]-2-phenyl-(1R)-ethylcarboxamido]-(2S)-pentanamide::CHEMBL317969
SMILES CC(=O)N[C@@H](Cc1cccnc1)C(=O)N[C@H](Cc1ccccc1)C(=O)N[C@@H](CCCNC(N)=N)C(=O)N[C@@H](Cc1c[nH]c2ccccc12)C(N)=O
InChI Key InChIKey=UIBDIGUMWQQJIJ-XHPANXIASA-N
Data  3 EC50
  Tab Delimited (TSV)   2D SDfile   Computed 3D by Vconf -m prep SDfile
Find this compound or compounds like it in BindingDB:
Activity Spreadsheet -- Enzyme Inhibition Constant Data from BindingDB
Found 3 hits for monomerid = 50114746
TargetMelanocortin receptor 5(Mus musculus (Mouse))
University Of Florida
Curated by ChEMBL
LigandPNGBDBM50114746(1N-[1-carbamoyl-2-(1H-3-indolyl)-(1S)-ethyl]-5-ami...)
Affinity DataEC50:  400nM. Assay description: In vitro activaction of mouse recombinant Melanocortin-5 receptor.
In DepthDetails ArticlePubMed
TargetMelanocyte-stimulating hormone receptor(Mus musculus)
University Of Florida
Curated by ChEMBL
LigandPNGBDBM50114746(1N-[1-carbamoyl-2-(1H-3-indolyl)-(1S)-ethyl]-5-ami...)
Affinity DataEC50:  1.15E+3nM. Assay description: In vitro activaction of mouse recombinant Melanocortin-1 receptor.
In DepthDetails ArticlePubMed
TargetMelanocortin receptor 4(Mus musculus)
University Of Florida
Curated by ChEMBL
LigandPNGBDBM50114746(1N-[1-carbamoyl-2-(1H-3-indolyl)-(1S)-ethyl]-5-ami...)
Affinity DataEC50:  887nM. Assay description: In vitro activaction of mouse recombinant Melanocortin-4 receptor.
In DepthDetails ArticlePubMed