BDBM50114812 8-Oxo-8-(4-trifluoromethyl-phenyl)-octanoic acid hydroxyamide::CHEMBL95241::N-hydroxy-8-oxo-8-(4-(trifluoromethyl)phenyl)octanamide
SMILES ONC(=O)CCCCCCC(=O)c1ccc(cc1)C(F)(F)F
InChI Key InChIKey=FSBDCAXDYWVYAY-UHFFFAOYSA-N
Data  3 IC50
  Tab Delimited (TSV)   2D SDfile   Computed 3D by Vconf -m prep SDfile
Find this compound or compounds like it in BindingDB:
Activity Spreadsheet -- Enzyme Inhibition Constant Data from BindingDB
Found 3 hits for monomerid = 50114812
TargetHistone deacetylase 1(Homo sapiens (Human))
Methylgene
Curated by ChEMBL
LigandPNGBDBM50114812(8-Oxo-8-(4-trifluoromethyl-phenyl)-octanoic acid h...)
Affinity DataIC50:  45nM. Assay description: Inhibition against partially purified human histone deacetylase 1 (HDAC-1)
In DepthDetails ArticlePubMed
TargetHistone deacetylase 1(Homo sapiens (Human))
Methylgene
Curated by ChEMBL
LigandPNGBDBM50114812(8-Oxo-8-(4-trifluoromethyl-phenyl)-octanoic acid h...)
Affinity DataIC50:  45nM. Assay description: Inhibitory concentration against recombinant human Histone deacetylase 1
In DepthDetails ArticlePubMed
TargetHistone deacetylase 1(Homo sapiens (Human))
Methylgene
Curated by ChEMBL
LigandPNGBDBM50114812(8-Oxo-8-(4-trifluoromethyl-phenyl)-octanoic acid h...)
Affinity DataIC50:  45nM. Assay description: Inhibition of human HDAC1
In DepthDetails ArticlePubMed