BDBM50115069 4-Fluoro-N-[(6aR,10aS)-2-(4,5,7,8,10,10a-hexahydro-6aH-pyrido[4,3-b]pyrrolo[3,2,1-hi]indol-9-yl)-ethyl]-benzamide::CHEMBL301332
SMILES Fc1ccc(cc1)C(=O)NCCN1CC[C@@H]2[C@H](C1)c1cccc3CCN2c13
InChI Key InChIKey=CSZLRTXLHDVGDH-WOJBJXKFSA-N
Data  1 IC50
  Tab Delimited (TSV)   2D SDfile   Computed 3D by Vconf -m prep SDfile
Find this compound or compounds like it in BindingDB:
Activity Spreadsheet -- Enzyme Inhibition Constant Data from BindingDB
Found 1 hit for monomerid = 50115069
TargetC-C chemokine receptor type 3(Homo sapiens (Human))
Bristol-Myers Squibb
Curated by ChEMBL
LigandPNGBDBM50115069(4-Fluoro-N-[(6aR,10aS)-2-(4,5,7,8,10,10a-hexahydro...)
Affinity DataIC50:  8.30E+3nM. Assay description: In vitro inhibition if C-C chemokine receptor type 3 (CCR3) using 150p M [125I]-labeled human eotaxin
In DepthDetails ArticlePubMed