BDBM50115504 CHEMBL3609223
SMILES [H][C@@]12CCCN1C(=O)[C@@]([H])(NC(=O)[C@@]([H])(NC(=O)[C@H](CC(O)=O)NC(=O)[C@@]([H])(NC(=O)[C@H](CSSC[C@H](NC(=O)[C@@]([H])(NC(=O)CNC(=O)[C@]1([H])CSSC[C@]3([H])NC(=O)[C@H](C)NC(=O)[C@H](Cc4ccccc4)NC(=O)[C@H](C)NC(=O)[C@@]([H])(NC(=O)[C@]([H])(CSSC[C@]([H])(NC(=O)[C@H](Cc4ccccc4)NC(=O)[C@H](CO)NC(=O)[C@H](CC(C)C)NC(=O)[C@H](CCCNC(N)=N)NC(=O)[C@H](Cc4ccc(O)cc4)NC(=O)[C@H](CCCCN)NC(=O)[C@H](CCSC)NC(=O)[C@H](CO)NC(=O)[C@H](Cc4cnc[nH]4)NC(=O)[C@H](CCCCN)NC3=O)C(=O)N[C@@H](CCCNC(N)=N)C(=O)N[C@@H](CCCCN)C(=O)N[C@@]([H])([C@@H](C)O)C(=O)N1)NC(=O)[C@H](CCCNC(N)=N)NC(=O)[C@H](CO)NC(=O)[C@H](CCCCN)NC2=O)[C@@H](C)O)[C@@H](C)O)C(O)=O)NC(=O)[C@H](CO)NC(=O)[C@@H](N)CCCNC(N)=N)[C@@H](C)CC)[C@@H](C)O)[C@@H](C)CC
InChI Key InChIKey=YYFOLISOLSRUEH-QZJXYQOQSA-N
Data  4 IC50
  Tab Delimited (TSV)   2D SDfile   Computed 3D by Vconf -m prep SDfile
Find this compound or compounds like it in BindingDB:
Activity Spreadsheet -- Enzyme Inhibition Constant Data from BindingDB
Found 4 hits for monomerid = 50115504
TargetPotassium voltage-gated channel subfamily A member 3(Homo sapiens (Human))
Amgen
Curated by ChEMBL
LigandPNGBDBM50115504(CHEMBL3609223)
Affinity DataIC50:  0.196nM. Assay description: Antagonist activity at human Kv1.3 expressed in CHOK1 cells assessed as inhibition of potassium currents after 10 mins by IonWorks Quattro patch clam...
In DepthDetails ArticlePubMed
TargetPotassium voltage-gated channel subfamily A member 3(Homo sapiens (Human))
Amgen
Curated by ChEMBL
LigandPNGBDBM50115504(CHEMBL3609223)
Affinity DataIC50:  0.0900nM. Assay description: Antagonist activity at Kv1.3 in human whole blood assessed as inhibition of thapsigargin-induced IFN-gamma secretion incubated for 30 prior to thapsi...
In DepthDetails ArticlePubMed
TargetPotassium voltage-gated channel subfamily A member 3(Homo sapiens (Human))
Amgen
Curated by ChEMBL
LigandPNGBDBM50115504(CHEMBL3609223)
Affinity DataIC50:  0.0540nM. Assay description: Antagonist activity at Kv1.3 in human whole blood assessed as inhibition of thapsigargin-induced IL-2 secretion incubated for 30 prior to thapsigargi...
In DepthDetails ArticlePubMed
TargetPotassium voltage-gated channel subfamily A member 1(Homo sapiens (Human))
Amgen
Curated by ChEMBL
LigandPNGBDBM50115504(CHEMBL3609223)
Affinity DataIC50:  0.00200nM. Assay description: Antagonist activity at human Kv1.1 expressed in HEK293 cells assessed as inhibition of potassium currents after 10 mins by IonWorks Quattro patch cla...
In DepthDetails ArticlePubMed