BDBM50115535 (2,4-Dimethyl-1-oxy-pyridin-3-yl)-{4-[(4-methanesulfonyl-phenyl)-methoxyimino-methyl]-4'-methyl-[1,4']bipiperidinyl-1'-yl}-methanone::CHEMBL138655::CHEMBL432636
SMILES CO[N-][C+](C1CCN(CC1)C1(C)CCN(CC1)C(=O)c1c(C)cc[n+]([O-])c1C)c1ccc(cc1)S(C)(=O)=O
InChI Key InChIKey=VPBHREZHCLGHFW-UHFFFAOYSA-N
Data  2 KI
  Tab Delimited (TSV)   2D SDfile   Computed 3D by Vconf -m prep SDfile
Find this compound or compounds like it in BindingDB:
Activity Spreadsheet -- Enzyme Inhibition Constant Data from BindingDB
Found 2 hits for monomerid = 50115535
TargetC-C chemokine receptor type 5(Homo sapiens (Human))
Lindsley F. Kimball Research Institute
Curated by ChEMBL
LigandPNGBDBM50115535((2,4-Dimethyl-1-oxy-pyridin-3-yl)-{4-[(4-methanesu...)
Affinity DataKi:  30nM. Assay description: Inhibition of RANTES binding to the human C-C chemokine receptor type 5 (CCR5)
In DepthDetails ArticlePubMed
TargetC-C chemokine receptor type 5(Mus musculus)
Schering-Plough Research Institute
Curated by ChEMBL
LigandPNGBDBM50115535((2,4-Dimethyl-1-oxy-pyridin-3-yl)-{4-[(4-methanesu...)
Affinity DataKi:  30nM. Assay description: Inhibition of RANTES binding to Chemokine receptor type 5 receptor from NIH 3T3 cells
In DepthDetails ArticlePubMed