BDBM50115650 (R)-2-(7-Hydroxycarbamoyl-heptanoylamino)-3-phenyl-propionic acid methyl ester::2-(7-Hydroxycarbamoyl-heptanoylamino)-3-phenyl-propionic acid methyl ester::CHEMBL109960
SMILES COC(=O)[C@@H](Cc1ccccc1)NC(=O)CCCCCCC(=O)NO
InChI Key InChIKey=AXUYKQYDXYCOFL-OAHLLOKOSA-N
Data  2 IC50
  Tab Delimited (TSV)   2D SDfile   Computed 3D by Vconf -m prep SDfile
Find this compound or compounds like it in BindingDB:
Activity Spreadsheet -- Enzyme Inhibition Constant Data from BindingDB
Found 2 hits for monomerid = 50115650
TargetHistone deacetylase 2b(Zea mays)
Aton Pharma
Curated by ChEMBL
LigandPNGBDBM50115650((R)-2-(7-Hydroxycarbamoyl-heptanoylamino)-3-phenyl...)
Affinity DataIC50:  760nM. Assay description: Inhibitory concentration against maize Histone deacetylase 2
In DepthDetails ArticlePubMed
TargetHistone deacetylase 2b(Zea mays)
Aton Pharma
Curated by ChEMBL
LigandPNGBDBM50115650((R)-2-(7-Hydroxycarbamoyl-heptanoylamino)-3-phenyl...)
Affinity DataIC50:  760nM. Assay description: Inhibition of in vitro enzyme activity measured in a highly purified maize Histone deacetylase 2 preparation
In DepthDetails ArticlePubMed