BDBM50115988 3-[(Benzyl-methyl-amino)-methyl]-8-(2,6-difluoro-benzyl)-2-[4-(3-ethyl-ureido)-phenyl]-5-oxo-5,8-dihydro-imidazo[1,2-a]pyrimidine-6-carboxylic acid propyl ester::CHEMBL293921
SMILES CCNC(=O)Nc1ccc(cc1)-c1nc2n(Cc3c(F)cccc3F)cc(C(=O)OC(C)C)c(=O)n2c1CN(C)Cc1ccccc1
InChI Key InChIKey=KMJBQQVXZCZHNB-UHFFFAOYSA-N
Data  1 IC50
  Tab Delimited (TSV)   2D SDfile   Computed 3D by Vconf -m prep SDfile
Find this compound or compounds like it in BindingDB:
Activity Spreadsheet -- Enzyme Inhibition Constant Data from BindingDB
Found 1 hit for monomerid = 50115988
TargetGonadotropin-releasing hormone receptor(Homo sapiens (Human))
Takeda Chemical Industries
Curated by ChEMBL
LigandPNGBDBM50115988(3-[(Benzyl-methyl-amino)-methyl]-8-(2,6-difluoro-b...)
Affinity DataIC50:  0.300nM. Assay description: In vitro inhibition of specific [125I]-leuprorelin binding to the cloned human LHRH receptor expressed in chinese hamster ovary cells
In DepthDetails ArticlePubMed