BDBM50115993 2-(4-Benzoylamino-phenyl)-3-[(benzyl-methyl-amino)-methyl]-8-(2,6-difluoro-benzyl)-5-oxo-5,8-dihydro-imidazo[1,2-a]pyrimidine-6-carboxylic acid ethyl ester::CHEMBL291893
SMILES CCOC(=O)c1cn(Cc2c(F)cccc2F)c2nc(c(CN(C)Cc3ccccc3)n2c1=O)-c1ccc(NC(=O)c2ccccc2)cc1
InChI Key InChIKey=IAPQVOLLBFCQRK-UHFFFAOYSA-N
Data  1 IC50
  Tab Delimited (TSV)   2D SDfile   Computed 3D by Vconf -m prep SDfile
Find this compound or compounds like it in BindingDB:
Activity Spreadsheet -- Enzyme Inhibition Constant Data from BindingDB
Found 1 hit for monomerid = 50115993
TargetGonadotropin-releasing hormone receptor(Homo sapiens (Human))
Takeda Chemical Industries
Curated by ChEMBL
LigandPNGBDBM50115993(2-(4-Benzoylamino-phenyl)-3-[(benzyl-methyl-amino)...)
Affinity DataIC50:  20nM. Assay description: In vitro inhibition of specific [125I]-leuprorelin binding to the cloned human LHRH receptor expressed in chinese hamster ovary cells
In DepthDetails ArticlePubMed