BDBM50116061 CHEMBL68078::N-((S)-3-{4-[(Z)-2-(3-Cyano-phenyl)-2-fluoro-vinyl]-3-fluoro-phenyl}-2-oxo-oxazolidin-5-ylmethyl)-acetamide
SMILES CC(=O)NC[C@H]1CN(C(=O)O1)c1ccc(\C=C(/F)c2cccc(c2)C#N)c(F)c1
InChI Key InChIKey=MRXJZTZCELFQFZ-XJBHOSEGSA-N
Data  1 IC50
  Tab Delimited (TSV)   2D SDfile   Computed 3D by Vconf -m prep SDfile
Find this compound or compounds like it in BindingDB:
Activity Spreadsheet -- Enzyme Inhibition Constant Data from BindingDB
Found 1 hit for monomerid = 50116061
TargetAmine oxidase [flavin-containing] B(Rattus norvegicus (rat))
Abbott Laboratories
Curated by ChEMBL
LigandPNGBDBM50116061(CHEMBL68078 | N-((S)-3-{4-[(Z)-2-(3-Cyano-phenyl)-...)
Affinity DataIC50: >3.00E+5nM. Assay description: Inhibition of Monoamine oxidase B in rat primary hepatocytes
In DepthDetails ArticlePubMed