BDBM50116080 3,5-Dichloro-N-{3-(3,4-dichloro-phenyl)-2-methoxyimino-5-[3-(2-morpholin-4-yl-2-oxo-ethyl)-2-oxo-[1,4']bipiperidinyl-1'-yl]-pentyl}-N-ethyl-benzamide::CHEMBL60504
SMILES CO\N=C(/CN(C)C(=O)c1cc(Cl)cc(Cl)c1)[C@H](CCN1CCC(CC1)N1CCCC(CC(=O)N2CCOCC2)C1=O)c1ccc(Cl)c(Cl)c1
InChI Key InChIKey=JMBOHNIWYYCZCP-XNMHLFPNSA-N
Data  2 KI
  Tab Delimited (TSV)   2D SDfile   Computed 3D by Vconf -m prep SDfile
Find this compound or compounds like it in BindingDB:
Activity Spreadsheet -- Enzyme Inhibition Constant Data from BindingDB
Found 2 hits for monomerid = 50116080
TargetSubstance-K receptor(GUINEA PIG)
The Schering Plough Research Institute
Curated by ChEMBL
LigandPNGBDBM50116080(3,5-Dichloro-N-{3-(3,4-dichloro-phenyl)-2-methoxyi...)
Affinity DataKi:  0.400nM. Assay description: In vitro binding to Tachykinin receptor 2
In DepthDetails ArticlePubMed
TargetSubstance-P receptor(GUINEA PIG)
The Schering Plough Research Institute
Curated by ChEMBL
LigandPNGBDBM50116080(3,5-Dichloro-N-{3-(3,4-dichloro-phenyl)-2-methoxyi...)
Affinity DataKi:  0.700nM. Assay description: In vitro binding to Tachykinin receptor 1
In DepthDetails ArticlePubMed