BDBM50116156 CHEMBL3612241
SMILES Cl.[H][C@]12CCC[C@]([H])([C@@H]1C(=O)OC)N(CCc1ccccc1)CC2
InChI Key InChIKey=DEAQOMPHYCZTAC-UATJXVQHSA-N
Data  1 KI
  Tab Delimited (TSV)   2D SDfile   Computed 3D by Vconf -m prep SDfile
Find this compound or compounds like it in BindingDB:
Activity Spreadsheet -- Enzyme Inhibition Constant Data from BindingDB
Found 1 hit for monomerid = 50116156
TargetMu-type opioid receptor(Danio rerio)
Universidad De Salamanca
Curated by ChEMBL
LigandPNGBDBM50116156(CHEMBL3612241)
Affinity DataKi:  8.24E+3nM. Assay description: Displacement of [3H]-diprenorphine from zebrafish mu opioid receptor expressed in HEK293 cells after 1 hr by liquid scintillation counting
In DepthDetails ArticlePubMed