BDBM50116221 2-(4-Butyrylamino-phenyl)-8-(2-fluoro-benzyl)-3-{[methyl-(2-pyridin-2-yl-ethyl)-amino]-methyl}-5-oxo-5,8-dihydro-imidazo[1,2-a]pyrimidine-6-carboxylic acid ethyl ester::CHEMBL71141
SMILES CCCC(=O)Nc1ccc(cc1)-c1nc2n(Cc3ccccc3F)cc(C(=O)OCC)c(=O)n2c1CN(C)CCc1ccccn1
InChI Key InChIKey=KUDRWBVGSLDDLB-UHFFFAOYSA-N
Data  1 KI
  Tab Delimited (TSV)   2D SDfile   Computed 3D by Vconf -m prep SDfile
Find this compound or compounds like it in BindingDB:
Activity Spreadsheet -- Enzyme Inhibition Constant Data from BindingDB
Found 1 hit for monomerid = 50116221
TargetGonadotropin-releasing hormone receptor(Homo sapiens (Human))
Neurocrine Biosciences
Curated by ChEMBL
LigandPNGBDBM50116221(2-(4-Butyrylamino-phenyl)-8-(2-fluoro-benzyl)-3-{[...)
Affinity DataKi:  12nM. Assay description: Ability to inhibit [I125-Tyr5,DLeu6,NMeLeu7,Pro9-NEt]GnRH agonist binding to the cloned human Gonadotropin-releasing hormone receptor was evaluated
In DepthDetails ArticlePubMed