BDBM50116517 CHEMBL3609731
SMILES COc1cc(NC(=O)c2ccccn2)ccc1Br
InChI Key InChIKey=CGGMFNQNSCVDBR-UHFFFAOYSA-N
Data  2 IC50
  Tab Delimited (TSV)   2D SDfile   Computed 3D by Vconf -m prep SDfile
Find this compound or compounds like it in BindingDB:
Activity Spreadsheet -- Enzyme Inhibition Constant Data from BindingDB
Found 2 hits for monomerid = 50116517
TargetMetabotropic glutamate receptor 4(Homo sapiens (Human))
Massachusetts General Hospital
Curated by ChEMBL
LigandPNGBDBM50116517(CHEMBL3609731)
Affinity DataIC50:  324nM. Assay description: Displacement of [3H]N-(4-chloro-3-methoxyphenyl)picolinamide from human mGlu4 receptor expressed in CHO cell membranes incubated for 30 mins by liqui...
In DepthDetails ArticlePubMed
TargetMetabotropic glutamate receptor 4(Homo sapiens (Human))
Massachusetts General Hospital
Curated by ChEMBL
LigandPNGBDBM50116517(CHEMBL3609731)
Affinity DataIC50:  322nM. Assay description: Displacement of [3H]N-(4-chloro-3-methoxyphenyl)picolinamide from human mGlu4 receptor expressed in CHO cell membranes incubated for 30 mins by liqui...
In DepthDetails ArticlePubMed